Cinchonine

Condensed phase thermochemistry data

Data compiled by: Hussein Y. Afeefy, Joel F. Liebman, and Stephen E. Stein

Quantity Value Units Method Reference Comment
Δcsolid-2546.2kcal/molCcbBerthelot and Gaudechon, 1903

References

Berthelot and Gaudechon, 1903
Berthelot, M.; Gaudechon, Recherches sur les alcoloides des quiquinas, Ann. Chim. Phys., 1903, 29, 443-480. [all data]