Cholan-24-oic acid, 3,12-dioxo-, methyl ester, (5α)-

Normal alkane RI, non-polar column, temperature ramp

View large format table.

Column type Active phase I Reference Comment
CapillarySE-303281.Tandon, Axelson, et al., 198425. m/0.32 mm/0.25 μm, He, 10. K/min; Tstart: 200. C; Tend: 270. C

References

Tandon, Axelson, et al., 1984
Tandon, R.; Axelson, M.; Sjövall, J., Selective liquid chromatographic isolation and gas chromatographic-mass spectrometric analysis of ketonic bile acids in faeces, J. Chromatogr., 1984, 302, 1-14, https://doi.org/10.1016/S0021-9673(01)88993-7 . [all data]