Fenoxaprop-ethyl

Condensed phase thermochemistry data

Data compiled by: Hussein Y. Afeefy, Joel F. Liebman, and Stephen E. Stein

Quantity Value Units Method Reference Comment
Δfsolid-762.8 ± 6.1kJ/molCcrGromova and Rudakova, 1993
Quantity Value Units Method Reference Comment
Δcsolid-8630.3 ± 5.0kJ/molCcrGromova and Rudakova, 1993

References

Gromova and Rudakova, 1993
Gromova, T.I.; Rudakova, S.V., Enthalpies of combustion and formation of 6-chlorbenzoxazolone-2 and ethyl 2-[4(6-Chlorbenzoxazolyl-2-oxy)phenoxy]propionate, Russ. J. Phys. Chem. (Engl. Transl.), 1993, 67, 1396-1398, In original 1554. [all data]