2-Butenoic acid, 3-[(4-methylphenyl)amino]-2-nitro-, methyl ester, (E)-

Reaction thermochemistry data

Data compiled by: Hussein Y. Afeefy, Joel F. Liebman, and Stephen E. Stein

Individual Reactions

(Z)-3-(p-Methylphenylamino)-2-nitrocrotonic acid methyl ester = 2-Butenoic acid, 3-[(4-methylphenyl)amino]-2-nitro-, methyl ester, (E)-

By formula: C12H14N2O4 = C12H14N2O4

Quantity Value Units Method Reference Comment
Δr2.62kJ/molEqkChiara, Gomez-Sanchez, et al., 1990liquid phase; solvent: CD2Cl2; NMR

References

Chiara, Gomez-Sanchez, et al., 1990
Chiara, J.L.; Gomez-Sanchez, A.; Marcos, E.S., Spectral properties and isomerism of nitro enamines. Part 2. 3-Amino-2-nitrocrotonic esters, J. Chem. Soc. Perkin Trans. 2, 1990, 385-392. [all data]