2-(Ethylthio)-3-methyl-1-butene

Reaction thermochemistry data

Data compiled by: Hussein Y. Afeefy, Joel F. Liebman, and Stephen E. Stein

Individual Reactions

2-(Ethylthio)-3-methyl-1-butene = 2-Butene, 2-(ethylthio)-3-methyl-

By formula: C7H14S = C7H14S

Quantity Value Units Method Reference Comment
Δr-7.1 ± 0.8kJ/molEqkKimmelma and Taskinen, 1987liquid phase; solvent: THF

References

Kimmelma and Taskinen, 1987
Kimmelma, R.; Taskinen, E., Structure-stability relationships in vinyl sulfides. II. Stabilization energies due to alkyl and alkylthio groups attached to the β carbon of vinyl sulfides and vinyl ethers, Acta Chem. Scand., 1987, 41, 271-277. [all data]