HN3O4

Reaction thermochemistry data

Data compiled by: John E. Bartmess

Individual Reactions

N3O4- + Hydrogen cation = HN3O4

By formula: N3O4- + H+ = HN3O4

Quantity Value Units Method Reference Comment
Δr1286. ± 30.kJ/molG+TSSchmitt, Krempp, et al., 1992gas phase; Acidity between H2SO4, HNO3..NO3-. Reported: G: 297±7 kcal/mol. Readjusted to newer acidities - JEB; value altered from reference due to change in acidity scale
Quantity Value Units Method Reference Comment
Δr1257. ± 29.kJ/molIMRBSchmitt, Krempp, et al., 1992gas phase; Acidity between H2SO4, HNO3..NO3-. Reported: G: 297±7 kcal/mol. Readjusted to newer acidities - JEB; value altered from reference due to change in acidity scale

References

Schmitt, Krempp, et al., 1992
Schmitt, R.J.; Krempp, M.; Bierbaum, V.M., Gas Phase Chemistry of Dinitramide and Nitroacetylide Ions, Int. J. Mass Spectrom. Ion Proc., 1992, 117, 621, https://doi.org/10.1016/0168-1176(92)80116-I . [all data]