6H-Dibenzo(a,c)cyclohepten-6-one, 5,7-dihydro-

Phase change data

Data compiled by: William E. Acree, Jr., James S. Chickos

Quantity Value Units Method Reference Comment
Δsub95.6 ± 0.8kJ/molN/AVerevkin, 1998

Enthalpy of fusion

ΔfusH (kJ/mol) Temperature (K) Method Reference
18.16350.3DSCVerevkin, 1998

References

Verevkin, 1998
Verevkin, S.P., Thermochemistry of aromatic ketones. Experimental enthalpies of formation and structural effects, Thermochim. Acta, 1998, 310, 229-235. [all data]