Docosanoic acid

Phase change data

Data compiled as indicated in comments:
TRC - Thermodynamics Research Center, NIST Boulder Laboratories, Chris Muzny director
AC - William E. Acree, Jr., James S. Chickos
ALS - Hussein Y. Afeefy, Joel F. Liebman, and Stephen E. Stein

Quantity Value Units Method Reference Comment
Tfus353.2KN/ADrake and Melamed, 1948Uncertainty assigned by TRC = 1.5 K; TRC

Enthalpy of vaporization

ΔvapH (kcal/mol) Temperature (K) Method Reference Comment
29.23388.AStephenson and Malanowski, 1987Based on data from 373. - 600. K.; AC

Enthalpy of sublimation

ΔsubH (kcal/mol) Temperature (K) Method Reference Comment
46.2 ± 1.9344.6VDavies and Malpass, 1961ALS

In addition to the Thermodynamics Research Center (TRC) data available from this site, much more physical and chemical property data is available from the following TRC products:

References

Drake and Melamed, 1948
Drake, N.L.; Melamed, S., Tetratriacontanoic Acid and Related Compounds, J. Am. Chem. Soc., 1948, 70, 364-7. [all data]

Stephenson and Malanowski, 1987
Stephenson, Richard M.; Malanowski, Stanislaw, Handbook of the Thermodynamics of Organic Compounds, 1987, https://doi.org/10.1007/978-94-009-3173-2 . [all data]

Davies and Malpass, 1961
Davies, M.; Malpass, V.E., Heats of sublimation of straight-chain monocarboxylic acids, J. Chem. Soc., 1961, 1048-10. [all data]