Dihydrojasmone

Phase change data

Data compiled by: Robert L. Brown and Stephen E. Stein

Reduced pressure boiling point

Tboil (K) Pressure (bar) Reference
416.70.029Weast and Grasselli, 1989
389.20.016Weast and Grasselli, 1989

References

Weast and Grasselli, 1989
CRC Handbook of Data on Organic Compounds, 2nd Editon, Weast,R.C and Grasselli, J.G., ed(s)., CRC Press, Inc., Boca Raton, FL, 1989, 1. [all data]