O-methoxybenzylidene methyl amine

Gas phase ion energetics data

Data compiled by: Sharon G. Lias, Rhoda D. Levin, and Sherif A. Kafafi

Ionization energy determinations

IE (eV) Method Reference Comment
8.22PEFragala, Millefiori, et al., 1980Vertical value

References

Fragala, Millefiori, et al., 1980
Fragala, I.; Millefiori, S.; Recca, A., Gas phase ultraviolet photoelectron spectra of aromatic azomethine compounds, J. Chem. Res. Synop., 1980, 1, 28. [all data]