Pyridine, 2-ethyl-6-methyl-

Kovats' RI, non-polar column, isothermal

View large format table.

Column type Active phase Temperature (C) I Reference Comment
CapillaryOV-101110.960.Zhuravleva, Terenina, et al., 199040. m/0.27 mm/0.4 μm
PackedApiezon L130.971.Shatts, Avots, et al., 1977He, Chromosorb W AW-DMCS; Column length: 2.4 m

Kovats' RI, polar column, isothermal

View large format table.

Column type Active phase Temperature (C) I Reference Comment
CapillaryPEG-40M110.1317.Zhuravleva, Terenina, et al., 199040. m/0.22 mm/0.40 μm

Van Den Dool and Kratz RI, polar column, custom temperature program

View large format table.

Column type Active phase I Reference Comment
CapillaryCarbowax 20M1292.Baltes and Bochmann, 1987Column length: 50. m; Column diameter: 0.3 mm; Program: not specified

Normal alkane RI, non-polar column, custom temperature program

View large format table.

Column type Active phase I Reference Comment
CapillarySE-30962.Li, Gao, et al., 2000Program: not specified

Normal alkane RI, polar column, custom temperature program

View large format table.

Column type Active phase I Reference Comment
CapillaryCarbowax1290.Baltes and Bochmann, 1987, 2Program: not specified
CapillaryCarbowax1292.Baltes and Bochmann, 1987, 2Program: not specified
CapillaryCarbowax1292.Baltes and Bochmann, 1987, 2Program: not specified
CapillaryCarbowax1294.Baltes and Bochmann, 1987, 2Program: not specified

References

Zhuravleva, Terenina, et al., 1990
Zhuravleva, I.L.; Terenina, M.B.; Shenderyuk, V.V.; Golovnya, R.V., Capillary chromatography. Calculation of retention indices of alkylpyridines on the basis of non-equal energy contributions of identical alkyl groups, Zh. Anal. Khim., 1990, 45, 722-729. [all data]

Shatts, Avots, et al., 1977
Shatts, V.D.; Avots, A.A.; Belikov, V.A., Retention indices of alkylpyridines, Zh. Anal. Khim., 1977, 32, 4, 631-638. [all data]

Baltes and Bochmann, 1987
Baltes, W.; Bochmann, G., Model reactions on roast aroma formation. 1. Reaction of serine and threonine with sucrose under the conditions of coffee roasting and identification of new coffee aroma compounds, J. Agric. Food Chem., 1987, 35, 3, 340-346, https://doi.org/10.1021/jf00075a015 . [all data]

Li, Gao, et al., 2000
Li, R.; Gao, S.-G.; Xiang, B.-R., Using improved BP neural network in predicting GC retention indices, Computers appl. chem. (Chinese), 2000, 17, 1-2, 113-114. [all data]

Baltes and Bochmann, 1987, 2
Baltes, W.; Bochmann, G., Model reactions on roast aroma formations, V. Mass spectrometric identification of pyrifines, oxazoles, and carbocyclic compounds from the reaction of serine and threonine with sucrose under the conditions of coffee roasting, Z. Lebensm. Unters. Forsch., 1987, 185, 1, 5-9, https://doi.org/10.1007/BF01083331 . [all data]