trans-4,6-Dimethyl-1,3-dioxane

Condensed phase thermochemistry data

Data compiled by: Hussein Y. Afeefy, Joel F. Liebman, and Stephen E. Stein

Quantity Value Units Method Reference Comment
Δfliquid-462.6 ± 1.8kJ/molCcbPihlaja and Luoma, 1968
Quantity Value Units Method Reference Comment
Δcliquid-3613.5 ± 1.8kJ/molCcbPihlaja and Luoma, 1968Corresponding Δfliquid = -462.58 kJ/mol (simple calculation by NIST; no Washburn corrections)

References

Pihlaja and Luoma, 1968
Pihlaja, K.; Luoma, S., Heats of formation and conformational energies of 1,3-dioxane and its methyl homologues, Acta Chem. Scand., 1968, 22, 2401-2414. [all data]