3-Pyridinol, 2-methyl-

Condensed phase thermochemistry data

Data compiled by: Hussein Y. Afeefy, Joel F. Liebman, and Stephen E. Stein

Quantity Value Units Method Reference Comment
Δfsolid-173.6 ± 1.2kJ/molCcbSuradi, El Saiad, et al., 1982
Quantity Value Units Method Reference Comment
Δcsolid-3187.9 ± 0.9kJ/molCcbSuradi, El Saiad, et al., 1982

Gas phase thermochemistry data

Data compiled by: Hussein Y. Afeefy, Joel F. Liebman, and Stephen E. Stein

Quantity Value Units Method Reference Comment
Δfgas-84.5 ± 1.8kJ/molCcbSuradi, El Saiad, et al., 1982

Van Den Dool and Kratz RI, polar column, temperature ramp

View large format table.

Column type Active phase I Reference Comment
CapillaryOV-3512140.Bonvehí, 200550. m/0.32 mm/0.2 μm, He, 5. K/min; Tstart: 60. C; Tend: 220. C

References

Suradi, El Saiad, et al., 1982
Suradi, S.; El Saiad, N.; Pilcher, G.; Skinner, H.A., Enthalpies of combustion of the three hydroxy-pyridines and the four hydroxy-2-methylpyridines, J. Chem. Thermodyn., 1982, 14, 45-50. [all data]