Isopropylamine, N-acetyl-

Phase change data

Data compiled by: William E. Acree, Jr., James S. Chickos

Quantity Value Units Method Reference Comment
Δvap66.4 ± 0.3kJ/molCStarzewski, Wadso, et al., 1984

Condensed phase thermochemistry data

Data compiled by: Eugene S. Domalski and Elizabeth D. Hearing

Constant pressure heat capacity of liquid

Cp,liquid (cal/mol*K) Temperature (K) Reference
50.4298.15Konicek and Wadso, 1971

Kovats' RI, non-polar column, isothermal

View large format table.

Column type Active phase Temperature (C) I Reference Comment
PackedSE-30180.895.Krawczyk and Piotrowski, 1989N2, Chromosorb W AW; Column length: 1. m
PackedApiezon L150.883.Zhuravleva I.L., Golovnya R.V., et al., 1978N2, Chromosorb G-AW; Column length: 2.7 m

Kovats' RI, polar column, isothermal

View large format table.

Column type Active phase Temperature (C) I Reference Comment
PackedPolyethylene Glycol150.1651.Zhuravleva I.L., Golovnya R.V., et al., 1978N2, Chromosorb G-AW; Column length: 2.7 m

Normal alkane RI, non-polar column, custom temperature program

View large format table.

Column type Active phase I Reference Comment
CapillaryPolydimethyl siloxanes895.Zenkevich and Chupalov, 1996Program: not specified

References

Starzewski, Wadso, et al., 1984
Starzewski, P.; Wadso, I.; Zielenkiewicz, W., Enthalpies of vaporization of some N-alkylamides at 298.15 K, J. Chem. Thermodyn., 1984, 16, 331-334. [all data]