2-(3-Methylbutyl)-3,5-dimethylpyrazine

Normal alkane RI, polar column, custom temperature program

Data compiled by: NIST Mass Spectrometry Data Center, William E. Wallace, director

Column type CapillaryCapillary
Active phase Carbowax 20MCarbowax 20M
Column length (m)
Carrier gas
Substrate
Column diameter (mm)
Phase thickness (μm)
Program not specifiednot specified
I 1530.1530.
ReferenceVernin, Lageot, et al., 1998Vernin, Lageot, et al., 1998
Comment MSDC-RI MSDC-RI

References

Vernin, Lageot, et al., 1998
Vernin, G.; Lageot, C.; Parkanyi, C., GC-MS(EI, PCI, NCI, SIM, ITMS) Data Bank Analysis of Flavors and Fragrances. Kovats indices in Instrumental Methods on Food and Beverage Analysis, D. Wetzel, G. Charalambous, ed(s)., Elsevier Sci. B.V., Amsterdam, 1998, 245-301. [all data]