9-Octadecenoic acid (Z)-, 2,3-dihydroxypropyl ester

Van Den Dool and Kratz RI, non-polar column, temperature ramp

Data compiled by: NIST Mass Spectrometry Data Center, William E. Wallace, director

Column type Capillary
Active phase HP-5
Column length (m) 30.
Carrier gas He
Substrate
Column diameter (mm) 0.25
Phase thickness (μm) 0.25
Tstart (C) 50.
Tend (C) 290.
Heat rate (K/min) 4.
Initial hold (min)
Final hold (min) 15.
I 2714.
ReferenceReis, de Faria, et al., 2000
Comment MSDC-RI

References

Reis, de Faria, et al., 2000
Reis, M.G.; de Faria, A.D.; Bittrich, V.; Amaral, M.C.E.; Marsaioli, A.J., The chemistry of flower rewards - Oncidium (Orchidaceae), J. Braz. Chem. Soc., 2000, 11, 6, 600-608, retrieved from http://jbcs.sbq.org.br/jbcs/2000/vol11n6/07.pdf, https://doi.org/10.1590/S0103-50532000000600008 . [all data]