1,1-Ethanediol, 2,2,2-trifluoro-1-(4-methoxyphenyl)-

Reaction thermochemistry data

Data compiled by: Hussein Y. Afeefy, Joel F. Liebman, and Stephen E. Stein

Individual Reactions

4'-Methoxy-2,2,2-trifluoroacetophenone + Water = 1,1-Ethanediol, 2,2,2-trifluoro-1-(4-methoxyphenyl)-

By formula: C9H7F3O2 + H2O = C9H9F3O3

Quantity Value Units Method Reference Comment
Δr-28.kJ/molEqkStewart and Van Dyke, 1972liquid phase; solvent: Aqueous

References

Stewart and Van Dyke, 1972
Stewart, R.; Van Dyke, J.D., The Hydration of ketones in mixtures of water and polar aprotic solvents, Can. J. Chem., 1972, 50, 1992-1999. [all data]