Ethanamine, 2-chloro-N,N-dimethyl-

Van Den Dool and Kratz RI, non-polar column, temperature ramp

View large format table.

Column type Active phase I Reference Comment
CapillaryCP Sil 8 CB750.38Jagadeshwar Reddy, Prabhakar, et al., 200630. m/0.25 mm/0.25 μm, He, 50. C @ 5. min, 10. K/min, 300. C @ 2. min

Normal alkane RI, non-polar column, custom temperature program

View large format table.

Column type Active phase I Reference Comment
CapillaryPolydimethyl siloxanes746.Zenkevich and Chupalov, 1996Program: not specified

References

Jagadeshwar Reddy, Prabhakar, et al., 2006
Jagadeshwar Reddy, T.; Prabhakar, S.; Ravi Kumar, M.; Vijaya Saradhi, U.V.R.; Vairamani, M., Mass spectral studies of a series of N,N-dialkyl aminoethyl-2-chlorides and trimethyl silyl ethers of N,N-dialkyl aminoethane-2-ols under electron impact conditions, J. Mass Spectrom., 2006, 41, 1, 59-70, https://doi.org/10.1002/jms.946 . [all data]

Zenkevich and Chupalov, 1996
Zenkevich, I.G.; Chupalov, A.A., New Possibilities of Chromato Mass Pectrometric Identification of Organic Compounds Using Increments of Gas Chromatographic Retention Indices of Molecular Structural Fragments, Zh. Org. Khim. (Rus.), 1996, 32, 5, 656-666. [all data]