8-Hydroxyisobornyl isobutyrate

Normal alkane RI, non-polar column, temperature ramp

View large format table.

Column type Active phase I Reference Comment
CapillaryDB-5MS1633.Marongiu, Piras, et al., 200530. m/0.25 mm/0.25 μm, He, 60. C @ 30. min, 3. K/min; Tend: 280. C
CapillaryDB-51673.Salehi, Sefidkon, et al., 200530. m/0.25 mm/0.25 μm, He, 60. C @ 4. min, 3. K/min; Tend: 220. C

References

Marongiu, Piras, et al., 2005
Marongiu, B.; Piras, A.; Porcedda, S.; Scorciapino, A., Chemical composition of the essential oil and supercritical CO2 extract of Commiphora myrrha (Nees) Engl. and of Acorus calamus L., J. Agric. Food Chem., 2005, 53, 20, 7939-7943, https://doi.org/10.1021/jf051100x . [all data]

Salehi, Sefidkon, et al., 2005
Salehi, P.; Sefidkon, F.; Bazzaz Tolami, L.; Sonboli, A., Essential oil composition of Salvia palaestina Benth. from Iran, Flavour Fragr. J., 2005, 20, 5, 525-527, https://doi.org/10.1002/ffj.1448 . [all data]