1,4-Oxathiane, 4,4-dioxide

Phase change data

Data compiled by: William E. Acree, Jr., James S. Chickos

Quantity Value Units Method Reference Comment
Δsub22.0 ± 0.24kcal/molMERoux, Temprado, et al., 2007Based on data from 307. - 322. K.

Enthalpy of sublimation

ΔsubH (kcal/mol) Temperature (K) Method Reference Comment
21.9 ± 0.24314.MERoux, Temprado, et al., 2007Based on data from 307. - 322. K.

References

Roux, Temprado, et al., 2007
Roux, María Victoria; Temprado, Manuel; Jiménez, Pilar; Notario, Rafael; Guzmán-Mejía, Ramón; Juaristi, Eusebio, Calorimetric and Computational Study of 1,3- and 1,4-Oxathiane Sulfones, J. Org. Chem., 2007, 72, 4, 1143-1147, https://doi.org/10.1021/jo0618472 . [all data]