3-Isoxazolamine, 5-methyl-

Gas phase thermochemistry data

Data compiled by: Hussein Y. Afeefy, Joel F. Liebman, and Stephen E. Stein

Quantity Value Units Method Reference Comment
Δfgas20. ± 3.kJ/molCcbHamilton and Ayers, 1973

References

Hamilton and Ayers, 1973
Hamilton, W.S.; Ayers, D.A., Heat of combustion of 3-Amino-5-methylisoxazole, J. Chem. Eng. Data, 1973, 18, 366-367. [all data]