1H-Imidazole, 2-ethyl-

Gas phase thermochemistry data

Data compiled by: Hussein Y. Afeefy, Joel F. Liebman, and Stephen E. Stein

Quantity Value Units Method Reference Comment
Δfgas68.3 ± 1.3kJ/molCcbJimenez, Roux, et al., 1992

References

Jimenez, Roux, et al., 1992
Jimenez, P.; Roux, M.V.; Turrion, C., Thermochemical properties of N-heterocyclic compounds IV. Enthalpies of combustion, vapour pressures and enthalpies of sublimation, and enthalpies of formation of 2-methylimidazole and 2-ethylimidazole and 2-ethylimidazole, J. Chem. Thermodyn., 1992, 24, 1145-1149. [all data]