13-docosenoic acid

Phase change data

Data compiled by: Thermodynamics Research Center, NIST Boulder Laboratories, Chris Muzny director

Quantity Value Units Method Reference Comment
Tfus334.65KN/AAdam, 1922Uncertainty assigned by TRC = 1. K

In addition to the Thermodynamics Research Center (TRC) data available from this site, much more physical and chemical property data is available from the following TRC products:

References

Adam, 1922
Adam, N.K., Proc. R. Soc. London, A, 1922, 101, 452. [all data]