lead distearate

Phase change data

Data compiled by: Eugene S. Domalski and Elizabeth D. Hearing

Enthalpy of fusion

ΔfusH (kJ/mol) Temperature (K) Reference Comment
62.600381.2Adeosun and Sime, 1976Crystal-smectic.

Entropy of fusion

ΔfusS (J/mol*K) Temperature (K) Reference Comment
164.381.2Adeosun and Sime, 1976Crystal-smectic.

Enthalpy of phase transition

ΔHtrs (kJ/mol) Temperature (K) Initial Phase Final Phase Reference Comment
56.900387.2liquidliquidAdeosun and Sime, 1976

Entropy of phase transition

ΔStrs (J/mol*K) Temperature (K) Initial Phase Final Phase Reference Comment
147.387.2liquid, Smecticliquid, liquidAdeosun and Sime, 1976

References

Adeosun and Sime, 1976
Adeosun, S.O.; Sime, S.J., Properties of molten carboxylates. Part 4: A quantitative differential thermal analysis study of melting and mesophase formation in some lead(II) carboxylates, Thermochim. Acta, 1976, 17, 351-359. [all data]