Ether, 6-methylheptyl vinyl

Phase change data

Data compiled by: Thermodynamics Research Center, NIST Boulder Laboratories, Chris Muzny director

Quantity Value Units Method Reference Comment
Tboil448.9KN/AMikhant'ev and Mikhant'ev, 1964Uncertainty assigned by TRC = 2. K

In addition to the Thermodynamics Research Center (TRC) data available from this site, much more physical and chemical property data is available from the following TRC products:

References

Mikhant'ev and Mikhant'ev, 1964
Mikhant'ev, B.I.; Mikhant'ev, V.B., Synthesis of Vinyl Nonyl Ether, Tr. Probl. Lab. Khim. Vysokomol. Soedin., Voronezh. Gos. Univ., 1964, No. 3, 18-19. [all data]