Ethylene glycol di-n-butyrate

Phase change data

Data compiled as indicated in comments:
ALS - Hussein Y. Afeefy, Joel F. Liebman, and Stephen E. Stein
AC - William E. Acree, Jr., James S. Chickos

Quantity Value Units Method Reference Comment
Δvap73.21 ± 0.60kJ/molCNilsson and Wadso, 1986ALS
Δvap73.2 ± 0.6kJ/molCNilsson and Wadso, 1986AC

Condensed phase thermochemistry data

Data compiled by: Eugene S. Domalski and Elizabeth D. Hearing

Constant pressure heat capacity of liquid

Cp,liquid (J/mol*K) Temperature (K) Reference
380.3298.15Nilsson and Wadso, 1986

References

Nilsson and Wadso, 1986
Nilsson, S.-O.; Wadso, I., Thermodynamic properties of some mono-, di-, and tri esters. Enthalpies of solution in water at 288.15 to 318.15 K and enthalpies of vaporization and heat capacities at 298.15 K, J. Chem. Thermodyn., 1986, 18, 673-681. [all data]