6-Octen-1-ol, 3,7-dimethyl-, benzoate

Normal alkane RI, polar column, custom temperature program

Data compiled by: NIST Mass Spectrometry Data Center, William E. Wallace, director

Column type Capillary
Active phase HP-Innowax FSC
Column length (m) 60.
Carrier gas He
Substrate
Column diameter (mm) 0.25
Phase thickness (μm) 0.25
Program 60C(10min) => 4C/min => 220C(10min) => 1C/min => 240C(20min)
I 2512.
ReferenceKamariah, Lim, et al., 1999
Comment MSDC-RI

References

Kamariah, Lim, et al., 1999
Kamariah, A.S.; Lim, L.B.L.; Baser, K.H.C.; Ozek, T.; Demirci, B., Composition of the essential oil of Plumeria obtusa L., Flavour Fragr. J., 1999, 14, 4, 237-240, https://doi.org/10.1002/(SICI)1099-1026(199907/08)14:4<237::AID-FFJ817>3.0.CO;2-Y . [all data]