4,5,6-Trimethyl-2,3-benzoxalene

Phase change data

Data compiled as indicated in comments:
ALS - Hussein Y. Afeefy, Joel F. Liebman, and Stephen E. Stein
DRB - Donald R. Burgess, Jr.

Quantity Value Units Method Reference Comment
Δsub139.5kJ/molVGeiseler, Quitzsch, et al., 1966Author's hf298_gas=58.4 kcal/mol; ALS
Δsub140.0kJ/molN/AGeiseler, Quitzsch, et al., 1966DRB

References

Geiseler, Quitzsch, et al., 1966
Geiseler, V.G.; Quitzsch, K.; Rauh, H.J.; Schaffernicht, H.; Walther, H.J., Bildungsenthalpien und Mesomerieenergien von π-Bindungssystemen 1. Mitteilung: Bildungsenthalpien und Mesomerieenergien einiger mehrkerniger Aromaten und verschiedener Pseudoazulene, Ber. Bunsen-Ges. Phys. Chem., 1966, 70, 551-556. [all data]