(1aR,1bS,2aS,5S,5aS,7aS)-2,2,5,7a-Tetramethyldecahydrocyclopenta[2',3']cyclobuta[1',2':3,4]benzo[1,2-b]oxirene

Van Den Dool and Kratz RI, non-polar column, custom temperature program

View large format table.

Column type Active phase I Reference Comment
CapillaryHP-5MS1558.Andriamaharavo, 201430. m/0.25 mm/0.25 μm, He; Program: 60C (1 min) => 5 C/min => 210C => 10 C/min => 280C (15 min)

Normal alkane RI, non-polar column, temperature ramp

View large format table.

Column type Active phase I Reference Comment
CapillaryHP-51549.Kahriman, Tosun, et al., 201130. m/0.32 mm/0.25 μm, Helium, 60. C @ 2. min, 3. K/min; Tend: 240. C

Normal alkane RI, non-polar column, custom temperature program

View large format table.

Column type Active phase I Reference Comment
Capillary5 % Phenyl polydimethyl siloxane1548.Chaverri, Diaz, et al., 2011Program: not specified
CapillaryHP-51549.Kahriman, Tosun, et al., 201130. m/0.32 mm/0.25 μm, Helium; Program: not specified
CapillaryDB-51549.de Menezes, Lemos, et al., 200530. m/0.25 mm/0.25 μm, He; Program: 35C => 4C/min => 180C => 10C/min => 250C

References

Andriamaharavo, 2014
Andriamaharavo, N.R., Retention Data. NIST Mass Spectrometry Data Center., NIST Mass Spectrometry Data Center, 2014. [all data]

Kahriman, Tosun, et al., 2011
Kahriman, N.; Tosun, G.; Terzioglu, S.; Karaoglu, S.A.; Yayh, N., Chemical composition and antimicrobial activity of the essential oils from the flower, leaf, and stem of Senecio pandurifolis, Rec. Nat. Prod., 2011, 5, 2, 82-91. [all data]

Chaverri, Diaz, et al., 2011
Chaverri, C.; Diaz, C.; Cicco, J.F., Chemical analysis of essential oils from Ocotea gomezii W.C. Burger and Ocotea morae Gomez-Laur. (Lauraceae) collected at Reserva biologica Alberto M. Brenes in Costa Rica and their cytotoxic activity on Tumor cell lines, J. Braz. Chem. Soc., 2011, 22, 4, s1-s4, https://doi.org/10.1590/S0103-50532011000400018 . [all data]

de Menezes, Lemos, et al., 2005
de Menezes, J.E.S.A.; Lemos, T.L.G.; Silveira, E.R.; Andrade-Neto, M.; Nascimento, R.F.; Pessoa, O.D.L., Volatile constituents of Cordia trichotoma Vell. from the northeast of Brazil, Flavour Fragr. J., 2005, 20, 2, 149-151, https://doi.org/10.1002/ffj.1394 . [all data]