Acridine 10-oxide

Gas phase ion energetics data

Data compiled as indicated in comments:
LLK - Sharon G. Lias, Rhoda D. Levin, and Sherif A. Kafafi

Ionization energy determinations

IE (eV) Method Reference Comment
7.45 ± 0.02PEMaier, Muller, et al., 1975Vertical value; LLK

References

Maier, Muller, et al., 1975
Maier, J.P.; Muller, J.-F.; Kubota, T.; Yamakawa, M., 183. Ionisation energies and the electronic structures of the N-oxides of azanaphthalenes and azaanthracenes, Helv. Chim. Acta, 1975, 58, 1641. [all data]