1-Norbornylisocyanide

Phase change data

Data compiled as indicated in comments:
AC - William E. Acree, Jr., James S. Chickos
ALS - Hussein Y. Afeefy, Joel F. Liebman, and Stephen E. Stein
DRB - Donald R. Burgess, Jr.

Quantity Value Units Method Reference Comment
Δsub60.6 ± 0.5kJ/molN/AMeier, Dogan, et al., 1987AC
Δsub60.58 ± 0.50kJ/molVMeier, Dogan, et al., 1987, 2ALS
Δsub60.6kJ/molN/AMeier, Dogan, et al., 1987, 2DRB

References

Meier, Dogan, et al., 1987
Meier, M.; Dogan, B.; Beckhaus, H.D.; Rüchardt, C., Heats of formation and heats of isomerization of isocyanides, New J. Chem., 1987, 11, 1, 1. [all data]

Meier, Dogan, et al., 1987, 2
Meier, M.; Dogan, B.; Beckhaus, H.; Ruchardt, C., Heats of formation and heats of isomerization of isocyanides, New J. Chem., 1987, 11, 1-6. [all data]