Tricyclo[3.3.1.13,7]decane, 1-(3,3-dimethyl-1-butynyl)-

Gas phase ion energetics data

Data compiled by: Sharon G. Lias, John E. Bartmess, Joel F. Liebman, John L. Holmes, Rhoda D. Levin, and W. Gary Mallard

Ionization energy determinations

IE (eV) Method Reference
8.77PIOrlov, Boganov, et al., 1985

Appearance energy determinations

Ion AE (eV) Other Products MethodReferenceComment
C15H21+9.82CH3PIOrlov, Boganov, et al., 1985

References

Orlov, Boganov, et al., 1985
Orlov, V.M.; Boganov, A.M.; Siretskaya, T.V.; Takhistov, V.V., Thermochemical characteristics of the molecular and fragmentation ions of substituted tert-butylacetylenes, Izv. Akad. Nauk SSSR Ser. Khim., 1985, 12, 2795. [all data]