1,5-Anhydro-2-O-acetyl-3,4,6-tri-O-methyl-D-galactitol

Van Den Dool and Kratz RI, non-polar column, temperature ramp

View large format table.

Column type Active phase I Reference Comment
CapillaryDB-51589.03Elvebak, Abbott, et al., 199530. m/0.25 mm/0.25 μm, He, 2. K/min; Tstart: 80. C; Tend: 250. C

References

Elvebak, Abbott, et al., 1995
Elvebak, L.E., II; Abbott, C.; Wall, S.; Gray, G.R., Authentic standards for the reductive-cleavage method. The positional isomers of partially methylated and acetylated or benzoylated 1,5-anhydro-D-galactitol, Carbohyd. Res., 1995, 269, 1, 1-15, https://doi.org/10.1016/0008-6215(94)00353-H . [all data]