Butanamide, 3-oxo-N-phenyl-

Reaction thermochemistry data

Data compiled by: Hussein Y. Afeefy, Joel F. Liebman, and Stephen E. Stein

Individual Reactions

Butanamide, 3-oxo-N-phenyl- = 3-Buten-2-one, 4-hydroxy-4-(phenylamino)-

By formula: C10H11NO2 = C10H11NO2

Quantity Value Units Method Reference Comment
Δr-15.7kJ/molEqkKumari, Taneja, et al., 1985solid phase; solvent: Ethanol; Heat of tautomerisation

References

Kumari, Taneja, et al., 1985
Kumari, R.; Taneja, A.D.; Kudesia, V.P., Studies of enolization of some substituted acetoacetarylamides at different temperatures and concentrations, Rev. Roum. Chim., 1985, 30, 141-150. [all data]