2-Methoxy-3-(o-methoxyphenyl)propene

Reaction thermochemistry data

Data compiled by: Hussein Y. Afeefy, Joel F. Liebman, and Stephen E. Stein

Individual Reactions

2-Methoxy-3-(o-methoxyphenyl)propene = (E)-2-Methoxy-1-(o-methoxyphenyl)propene

By formula: C11H14O2 = C11H14O2

Quantity Value Units Method Reference Comment
Δr-3.6 ± 0.9kJ/molEqkTaskinen and Kuusisto, 1985liquid phase; solvent: Cyclohexane

2-Methoxy-3-(o-methoxyphenyl)propene = Benzene, 1-methoxy-2-(2-methoxy-1-propenyl)-, (Z)-

By formula: C11H14O2 = C11H14O2

Quantity Value Units Method Reference Comment
Δr2.1 ± 0.9kJ/molEqkTaskinen and Kuusisto, 1985liquid phase; solvent: Cyclohexane

References

Taskinen and Kuusisto, 1985
Taskinen, E.; Kuusisto, M., Thermodynamics of vinyl ethers. XXVIII. Effects of steric strain on the stability of a C=C-Ph system, Acta Chem. Scand., Ser. B, 1985, 39, 495-499. [all data]