α-Methyl-cis-stilbene

Reaction thermochemistry data

Data compiled by: Hussein Y. Afeefy, Joel F. Liebman, and Stephen E. Stein

Individual Reactions

α-Methyl-cis-stilbene = Stilbene, α-methyl-, (E)-

By formula: C15H14 = C15H14

Quantity Value Units Method Reference Comment
Δr-2. ± 0.8kJ/molCisoFischer, Muszkat, et al., 1968solid phase; solvent: Cyclohexane

References

Fischer, Muszkat, et al., 1968
Fischer, G.; Muszkat, K.A.; Fischer, E., Thermodynamic equilibrium between cis- and trans-isomers in stilbene and some derivatives, J. Chem. Soc. B, 1968, 1156-1158. [all data]