Isoxazole, 3-methyl-5-phenyl-

Condensed phase thermochemistry data

Data compiled by: Hussein Y. Afeefy, Joel F. Liebman, and Stephen E. Stein

Quantity Value Units Method Reference Comment
Δfliquid18. ± 5.4kJ/molCcbTappi, 1940Heat of formation derived by Cox and Pilcher, 1970
Quantity Value Units Method Reference Comment
Δcsolid-5239.6 ± 5.4kJ/molCcbTappi, 1940Reanalyzed by Cox and Pilcher, 1970, Original value = -5244.2 ± 5.4 kJ/mol

References

Tappi, 1940
Tappi, G., Sul calore di combustione degli isossiazoli, Gazz. Chim. Ital., 1940, 70, 414-422. [all data]

Cox and Pilcher, 1970
Cox, J.D.; Pilcher, G., Thermochemistry of Organic and Organometallic Compounds, Academic Press, New York, 1970, 1-636. [all data]