Isoxazole, 5-methyl-3-phenyl-

Condensed phase thermochemistry data

Data compiled by: Hussein Y. Afeefy, Joel F. Liebman, and Stephen E. Stein

Quantity Value Units Method Reference Comment
Δfliquid14. ± 5.4kJ/molCcbTappi, 1940Heat of formation derived by Cox and Pilcher, 1970
Quantity Value Units Method Reference Comment
Δcsolid-5235.0 ± 5.4kJ/molCcbTappi, 1940Reanalyzed by Cox and Pilcher, 1970, Original value = -5238.4 ± 5.4 kJ/mol

Gas phase thermochemistry data

Data compiled by: Hussein Y. Afeefy, Joel F. Liebman, and Stephen E. Stein

Quantity Value Units Method Reference Comment
Δfgas98.7 ± 7.5kJ/molCcbTappi, 1940Heat of formation derived by Cox and Pilcher, 1970

Phase change data

Data compiled by: Hussein Y. Afeefy, Joel F. Liebman, and Stephen E. Stein

Quantity Value Units Method Reference Comment
Δvap84.9 ± 4.2kJ/molETappi, 1940Heat of formation derived by Cox and Pilcher, 1970

References

Tappi, 1940
Tappi, G., Sul calore di combustione degli isossiazoli, Gazz. Chim. Ital., 1940, 70, 414-422. [all data]

Cox and Pilcher, 1970
Cox, J.D.; Pilcher, G., Thermochemistry of Organic and Organometallic Compounds, Academic Press, New York, 1970, 1-636. [all data]