N-methyleneaniline

Gas phase ion energetics data

Data compiled by: Sharon G. Lias, John E. Bartmess, Joel F. Liebman, John L. Holmes, Rhoda D. Levin, and W. Gary Mallard

Ionization energy determinations

IE (eV) Method Reference Comment
8.5PEDistefano, Giumanini, et al., 1985
8.73PEDistefano, Giumanini, et al., 1985Vertical value

References

Distefano, Giumanini, et al., 1985
Distefano, G.; Giumanini, A.G.; Modelli, A.; Poggi, G., Reinvestigation of the formaldehyde-aniline condensation. Part 4. UV photoelectron and electron transmission spectra of N-methyleneaniline and its symmetric dimethyl eing-substituted homologues and semiempirical theoretical evaluation, J. Chem. Soc. Perkin Trans. 2, 1985, 1623. [all data]