Decane, 1-chloro-

Phase change data

Data compiled as indicated in comments:
BS - Robert L. Brown and Stephen E. Stein
TRC - Thermodynamics Research Center, NIST Boulder Laboratories, Chris Muzny director
AC - William E. Acree, Jr., James S. Chickos

Quantity Value Units Method Reference Comment
Tboil496.6KN/AWeast and Grasselli, 1989BS
Tboil495.65KN/AVogel and Olds, 1943Uncertainty assigned by TRC = 1.5 K; TRC
Tboil496.4KN/AKomppa and Talvitie, 1932Uncertainty assigned by TRC = 1.5 K; TRC
Quantity Value Units Method Reference Comment
Δvap64.0 ± 0.2kJ/molGSPuri, Chickos, et al., 2001AC

Enthalpy of vaporization

ΔvapH (kJ/mol) Temperature (K) Method Reference Comment
54.4394.N/ADykyj, Svoboda, et al., 1999Based on data from 379. - 530. K.; AC
56.2374.A,DTAStephenson and Malanowski, 1987Based on data from 359. - 499. K. See also Kemme and Kreps, 1969.; AC

Antoine Equation Parameters

log10(P) = A − (B / (T + C))
    P = vapor pressure (bar)
    T = temperature (K)

View plot Requires a JavaScript / HTML 5 canvas capable browser.

Temperature (K) A B C Reference
359.3 - 498.84.116621676.793-91.133Kemme and Kreps, 1969

In addition to the Thermodynamics Research Center (TRC) data available from this site, much more physical and chemical property data is available from the following TRC products:

Normal alkane RI, polar column, custom temperature program

Data compiled by: NIST Mass Spectrometry Data Center, William E. Wallace, director

Column type Capillary
Active phase DB-Wax
Column length (m)
Carrier gas
Substrate
Column diameter (mm)
Phase thickness (μm)
Program not specified
I 1474.
ReferencePeng, Yang, et al., 1991
Comment MSDC-RI

Kovats' RI, non-polar column, isothermal

View large format table.

Column type Active phase Temperature (C) I Reference Comment
PackedApiezon L150.1275.Jaworski, 1982

Kovats' RI, polar column, isothermal

View large format table.

Column type Active phase Temperature (C) I Reference Comment
PackedPEG-20M130.1455.Jaworski and Zolna, 1982Chromosorb W; Column length: 2.8 m
PackedPEG-20M130.1459.Jaworski and Zolna, 1982Chromosorb W; Column length: 2.8 m
PackedPEG-20M130.1459.Jaworski, 1982

Kovats' RI, polar column, temperature ramp

View large format table.

Column type Active phase I Reference Comment
PackedPEG-20M1452.Jaworski and Zolna, 1982Chromosorb W, 6. K/min; Column length: 2.8 m; Tstart: 110. C; Tend: 200. C
PackedPEG-20M1458.Jaworski and Zolna, 1982Chromosorb W, 6. K/min; Column length: 2.8 m; Tstart: 110. C; Tend: 200. C

Van Den Dool and Kratz RI, non-polar column, temperature ramp

View large format table.

Column type Active phase I Reference Comment
CapillaryDB-11249.6Sun and Stremple, 200330. m/0.25 mm/0.25 μm, He, 3. K/min; Tstart: 40. C; Tend: 325. C
CapillaryPetrocol DH1254.White, Hackett, et al., 1992100. m/0.25 mm/0.5 μm, He, 1. K/min; Tstart: 30. C; Tend: 220. C

Van Den Dool and Kratz RI, non-polar column, custom temperature program

View large format table.

Column type Active phase I Reference Comment
CapillaryDB-11257.Peng, 200015. m/0.53 mm/1. μm, He; Program: 40C(3min) => 8C/min => 200(1min) => 5C/min => 300C(25min)

Van Den Dool and Kratz RI, polar column, temperature ramp

View large format table.

Column type Active phase I Reference Comment
CapillaryDB-Wax1469.Peng, 200015. m/0.53 mm/1. μm, He, 40. C @ 3. min, 5. K/min, 220. C @ 30. min
CapillaryHP-Wax1468.Peng, 200015. m/0.53 mm/1. μm, He, 40. C @ 3. min, 5. K/min, 220. C @ 30. min

Normal alkane RI, non-polar column, isothermal

View large format table.

Column type Active phase Temperature (C) I Reference Comment
CapillaryApiezon L130.1263.Arruda, Junkes, et al., 2008

Normal alkane RI, non-polar column, temperature ramp

View large format table.

Column type Active phase I Reference Comment
CapillaryHP-5 MS1264.Kotowska, Zalikowski, et al., 201230. m/0.25 mm/0.25 μm, Helium, 35. C @ 5. min, 3. K/min, 300. C @ 15. min
CapillarySE-301256.Ibrahim and Suffet, 1988N2, 50. C @ 8. min, 5. K/min, 275. C @ 10. min; Column length: 60. m; Column diameter: 0.32 mm

Normal alkane RI, non-polar column, custom temperature program

View large format table.

Column type Active phase I Reference Comment
CapillaryHP-5 MS1261.Kotowska, Zalikowski, et al., 201230. m/0.25 mm/0.25 μm, Helium; Program: not specified
CapillarySE-301255.Ibrahim and Suffet, 1988N2; Column length: 60. m; Column diameter: 0.32 mm; Program: 50C(8min) => 3C/min => 150C => 35C/min => 275C (10min)

Normal alkane RI, polar column, temperature ramp

View large format table.

Column type Active phase I Reference Comment
PackedCarbowax 20M-TPA1470.Szymanowski, Kusz, et al., 1989Ar, Chromosorb W AW DMCS, 100. C @ 1. min, 5. K/min; Column length: 1.6 m; Tend: 220. C

References

Weast and Grasselli, 1989
CRC Handbook of Data on Organic Compounds, 2nd Editon, Weast,R.C and Grasselli, J.G., ed(s)., CRC Press, Inc., Boca Raton, FL, 1989, 1. [all data]

Vogel and Olds, 1943
Vogel, A.I.; Olds, R.H., J. Chem. Soc., 1943, 1943, 636. [all data]

Komppa and Talvitie, 1932
Komppa, G.; Talvitie, Y., The normal decyl series, J. Prakt. Chem., 1932, 135, 193-203. [all data]

Puri, Chickos, et al., 2001
Puri, Swati; Chickos, James S.; Welsh, William J., Determination of Vaporization Enthalpies of Polychlorinated Biphenyls by Correlation Gas Chromatography, Anal. Chem., 2001, 73, 7, 1480-1484, https://doi.org/10.1021/ac001246p . [all data]

Dykyj, Svoboda, et al., 1999
Dykyj, J.; Svoboda, J.; Wilhoit, R.C.; Frenkel, M.L.; Hall, K.R., Vapor Pressure of Chemicals: Part A. Vapor Pressure and Antoine Constants for Hydrocarbons and Sulfur, Selenium, Tellurium and Hydrogen Containing Organic Compounds, Springer, Berlin, 1999, 373. [all data]

Stephenson and Malanowski, 1987
Stephenson, Richard M.; Malanowski, Stanislaw, Handbook of the Thermodynamics of Organic Compounds, 1987, https://doi.org/10.1007/978-94-009-3173-2 . [all data]

Kemme and Kreps, 1969
Kemme, Herbert R.; Kreps, Saul I., Vapor pressure of primary n-alkyl chlorides and alcohols, J. Chem. Eng. Data, 1969, 14, 1, 98-102, https://doi.org/10.1021/je60040a011 . [all data]