Heptane, 2-chloro-

Phase change data

Data compiled by: William E. Acree, Jr., James S. Chickos

Enthalpy of vaporization

ΔvapH (kJ/mol) Temperature (K) Method Reference Comment
44.8328.AStephenson and Malanowski, 1987Based on data from 313. - 424. K. See also Dykyj, Svoboda, et al., 1999.

Normal alkane RI, non-polar column, custom temperature program

Data compiled by: NIST Mass Spectrometry Data Center, William E. Wallace, director

Column type Capillary
Active phase OV-1, SE-30, Methyl silicone, SP-2100, OV-101, DB-1, etc.
Column length (m) 50.
Carrier gas Hydrogen
Substrate
Column diameter (mm) 0.32
Phase thickness (μm)
Program not specified
I 894.
ReferenceWaggott and Davies, 1984
Comment MSDC-RI

Kovats' RI, non-polar column, isothermal

View large format table.

Column type Active phase Temperature (C) I Reference Comment
CapillaryApiezon L90.908.Morishita, Terashima, et al., 1983He; Column length: 45. m; Column diameter: 0.25 mm

Kovats' RI, polar column, isothermal

View large format table.

Column type Active phase Temperature (C) I Reference Comment
PackedCarbowax 20M100.1055.Castello and D'Amato, 1986He, Chromosorb W AW DMC; Column length: 3. m
PackedCarbowax 20M125.1065.Castello and D'Amato, 1986He, Chromosorb W AW DMC; Column length: 3. m
PackedCarbowax 20M75.1064.Castello and D'Amato, 1986He, Chromosorb W AW DMC; Column length: 3. m
CapillaryPEG-20M90.1077.Morishita, Terashima, et al., 1983He; Column length: 75. m; Column diameter: 0.25 mm

Van Den Dool and Kratz RI, non-polar column, temperature ramp

View large format table.

Column type Active phase I Reference Comment
CapillaryPetrocol DH897.White, Hackett, et al., 1992100. m/0.25 mm/0.5 μm, He, 1. K/min; Tstart: 30. C; Tend: 220. C

Normal alkane RI, non-polar column, isothermal

View large format table.

Column type Active phase Temperature (C) I Reference Comment
CapillaryApiezon L130.908.Arruda, Junkes, et al., 2008

Reaction thermochemistry data

Data compiled by: Hussein Y. Afeefy, Joel F. Liebman, and Stephen E. Stein

Individual Reactions

Heptane, 4-chloro- = Heptane, 2-chloro-

By formula: C7H15Cl = C7H15Cl

Quantity Value Units Method Reference Comment
Δr-0.09 ± 0.05kcal/molEqkKabo, Andreevskii, et al., 1967gas phase; Heat of isomerization

Heptane, 2-chloro- = 3-Chloroheptane

By formula: C7H15Cl = C7H15Cl

Quantity Value Units Method Reference Comment
Δr0.035kcal/molCisoRoganov, Kabo, et al., 1969liquid phase

Heptane, 2-chloro- = Heptane, 4-chloro-

By formula: C7H15Cl = C7H15Cl

Quantity Value Units Method Reference Comment
Δr0.090kcal/molCisoRoganov, Kabo, et al., 1969liquid phase

References

Stephenson and Malanowski, 1987
Stephenson, Richard M.; Malanowski, Stanislaw, Handbook of the Thermodynamics of Organic Compounds, 1987, https://doi.org/10.1007/978-94-009-3173-2 . [all data]

Dykyj, Svoboda, et al., 1999
Dykyj, J.; Svoboda, J.; Wilhoit, R.C.; Frenkel, M.L.; Hall, K.R., Vapor Pressure of Chemicals: Part A. Vapor Pressure and Antoine Constants for Hydrocarbons and Sulfur, Selenium, Tellurium and Hydrogen Containing Organic Compounds, Springer, Berlin, 1999, 373. [all data]