MeS-phenide anion

Reaction thermochemistry data

Data compiled by: John E. Bartmess

Individual Reactions

C7H7S- + Hydrogen cation = Benzene, (methylthio)-

By formula: C7H7S- + H+ = C7H8S

Quantity Value Units Method Reference Comment
Δr1616. ± 21.kJ/molG+TSIngemann and Nibbering, 1985gas phase; value altered from reference due to change in acidity scale
Quantity Value Units Method Reference Comment
Δr1586. ± 21.kJ/molIMRBIngemann and Nibbering, 1985gas phase; value altered from reference due to change in acidity scale

References

Ingemann and Nibbering, 1985
Ingemann, S.; Nibbering, N.M.M., Gas phase chemistry of alpha-thio carbanions, Can. J. Chem., 1985, 62, 2273. [all data]