cC5H10..Cl anion

Reaction thermochemistry data

Data compiled by: John E. Bartmess

Individual Reactions

Chlorine anion = C5H10Cl-

By formula: Cl- = C5H10Cl-

Quantity Value Units Method Reference Comment
Δr35.6kJ/molN/AZiegler, Gamble, et al., 2013gas phase
Quantity Value Units Method Reference Comment
Δr10.9kJ/molN/AZiegler, Gamble, et al., 2013gas phase

References

Ziegler, Gamble, et al., 2013
Ziegler, B.E.; Gamble, T.N.; Li, C.; McMahon, T.B., Weak Ion-Molecule Interactions in the Gas Phase: A High-Pressure Mass Spectrometry and Computational Study of Chloride-Alkane Interactions, J. Phys. Chem. A, 2013, 117, 28, 5785-5793, https://doi.org/10.1021/jp403422q . [all data]