mCN-C6H4CH2 anion

Reaction thermochemistry data

Data compiled by: John E. Bartmess

Individual Reactions

C8H6N- + Hydrogen cation = Benzonitrile, 3-methyl-

By formula: C8H6N- + H+ = C8H7N

Quantity Value Units Method Reference Comment
Δr1545. ± 8.8kJ/molG+TSCaldwell and Bartmessgas phase; value altered from reference due to change in acidity scale
Quantity Value Units Method Reference Comment
Δr1515. ± 8.4kJ/molIMRECaldwell and Bartmessgas phase; value altered from reference due to change in acidity scale

References

Caldwell and Bartmess
Caldwell, G.; Bartmess, J.E., , Unpublished results. [all data]