MeNO2..MeNO4 anion

Reaction thermochemistry data

Data compiled by: John E. Bartmess

Individual Reactions

C2H6N2O6- + 2Methane, nitro- = C3H9N3O8-

By formula: C2H6N2O6- + 2CH3NO2 = C3H9N3O8-

Quantity Value Units Method Reference Comment
Δr45.6 ± 2.5kJ/molTDAsWincel, 2003gas phase
Quantity Value Units Method Reference Comment
Δr15.5kJ/molTDAsWincel, 2003gas phase

References

Wincel, 2003
Wincel, H., Gas-phase Solvation of Cl-, NO2-, CH2NO2-, CH3NO2-, and CH3NO4- by CH3NO2, Int. J. Mass Spectrom., 2003, 226, 3, 341-353, https://doi.org/10.1016/S1387-3806(03)00066-6 . [all data]