SbCl3..Cl anion

Reaction thermochemistry data

Data compiled by: John E. Bartmess

Individual Reactions

Chlorine anion + Cl3Sb = Cl4Sb-

By formula: Cl- + Cl3Sb = Cl4Sb-

Quantity Value Units Method Reference Comment
Δr160. ± 7.9kJ/molCIDTWalker, Check, et al., 2002gas phase

Ion clustering data

Data compiled by: John E. Bartmess

Clustering reactions

Chlorine anion + Cl3Sb = Cl4Sb-

By formula: Cl- + Cl3Sb = Cl4Sb-

Quantity Value Units Method Reference Comment
Δr160. ± 7.9kJ/molCIDTWalker, Check, et al., 2002gas phase

References

Walker, Check, et al., 2002
Walker, B.W.; Check, C.E.; Lobring, K.C.; Pommerening, C.A.; Sunderlin, L.S., The Thermochemistry of Group 15 Tetrachloride Anions, J. Am. Soc. Mass Spectrom., 2002, 13, 5, 469, https://doi.org/10.1016/S1044-0305(02)00369-0 . [all data]