piPr-phenoxide anion

Reaction thermochemistry data

Data compiled by: John E. Bartmess

Individual Reactions

C9H11O- + Hydrogen cation = p-Cumenol

By formula: C9H11O- + H+ = C9H12O

Quantity Value Units Method Reference Comment
Δr1461. ± 8.8kJ/molG+TSFujio, McIver, et al., 1981gas phase; ΔHf(AH) disagrees with group additivity by 8.6 kcal/mol (-41.4 kcal/mol; value altered from reference due to change in acidity scale
Quantity Value Units Method Reference Comment
Δr1433. ± 8.4kJ/molIMREFujio, McIver, et al., 1981gas phase; ΔHf(AH) disagrees with group additivity by 8.6 kcal/mol (-41.4 kcal/mol; value altered from reference due to change in acidity scale

References

Fujio, McIver, et al., 1981
Fujio, M.; McIver, R.T., Jr.; Taft, R.W., Effects on the acidities of phenols from specific substituent-solvent interactions. Inherent substituent parameters from gas phase acidities, J. Am. Chem. Soc., 1981, 103, 4017. [all data]