(Xe)2..NO anion

Ion clustering data

Data compiled by: John E. Bartmess

Clustering reactions

NOXe- + 2Xenon = NOXe2-

By formula: NOXe- + 2Xe = NOXe2-

Quantity Value Units Method Reference Comment
Δr16.3kJ/molN/AHendricks, de Clercq, et al., 2002gas phase

NOXe2- + 3Xenon = NOXe3-

By formula: NOXe2- + 3Xe = NOXe3-

Quantity Value Units Method Reference Comment
Δr14.6kJ/molN/AHendricks, de Clercq, et al., 2002gas phase

References

Hendricks, de Clercq, et al., 2002
Hendricks, J.H.; de Clercq, H.L.; Freidhoff, C.B.; Arnold, S.T.; Eaton, J.G.; Fancher, C.; Lyapustina, S.A.; S., Anion solvation at the microscopic level: Photoelectron spectroscopy of the solvated anion clusters, NO-(Y)(n), where Y=Ar, Kr, Xe, N2O, H2S, NH3, H2O, and C2H4(OH)(2), J. Chem. Phys., 2002, 116, 18, 7926-7938, https://doi.org/10.1063/1.1457444 . [all data]