CF3C(Me)2O anion

Reaction thermochemistry data

Data compiled by: John E. Bartmess

Individual Reactions

C4H6F3O- + Hydrogen cation = 2-Trifluoromethyl-2-propanol

By formula: C4H6F3O- + H+ = C4H7F3O

Quantity Value Units Method Reference Comment
Δr1507. ± 8.8kJ/molG+TSCaldwell, McMahon, et al., 1985gas phase; value altered from reference due to change in acidity scale
Quantity Value Units Method Reference Comment
Δr1479. ± 8.4kJ/molIMRECaldwell, McMahon, et al., 1985gas phase; value altered from reference due to change in acidity scale

References

Caldwell, McMahon, et al., 1985
Caldwell, G.; McMahon, T.B.; Kebarle, P.; Bartmess, J.E.; Kiplinger, J.P., Methyl substituent effects in the gas phase acidities of halosubstituted oxygen acids. A realignment with substituent effects in solution, J. Am. Chem. Soc., 1985, 107, 80. [all data]