(CH4)4..F anion

Reaction thermochemistry data

Data compiled by: John E. Bartmess

Individual Reactions

C3H12F- + 4Methane = C4H16F-

By formula: C3H12F- + 4CH4 = C4H16F-

Quantity Value Units Method Reference Comment
Δr20.9kJ/molN/AHiraoka, Mizuno, et al., 2001gas phase
Quantity Value Units Method Reference Comment
Δr-9.04kJ/molTDAsHiraoka, Mizuno, et al., 2001gas phase

C4H16F- + 5Methane = C5H20F-

By formula: C4H16F- + 5CH4 = C5H20F-

Quantity Value Units Method Reference Comment
Δr18.8kJ/molN/AHiraoka, Mizuno, et al., 2001gas phase
Quantity Value Units Method Reference Comment
Δr-12.3kJ/molTDAsHiraoka, Mizuno, et al., 2001gas phase

Ion clustering data

Data compiled by: John E. Bartmess

Clustering reactions

C3H12F- + 4Methane = C4H16F-

By formula: C3H12F- + 4CH4 = C4H16F-

Quantity Value Units Method Reference Comment
Δr20.9kJ/molN/AHiraoka, Mizuno, et al., 2001gas phase
Quantity Value Units Method Reference Comment
Δr-9.04kJ/molTDAsHiraoka, Mizuno, et al., 2001gas phase

C4H16F- + 5Methane = C5H20F-

By formula: C4H16F- + 5CH4 = C5H20F-

Quantity Value Units Method Reference Comment
Δr18.8kJ/molN/AHiraoka, Mizuno, et al., 2001gas phase
Quantity Value Units Method Reference Comment
Δr-12.3kJ/molTDAsHiraoka, Mizuno, et al., 2001gas phase

References

Hiraoka, Mizuno, et al., 2001
Hiraoka, K.; Mizuno, T.; Iino, T.; Eguchi, D.; Yamabe, S., Characteristic changes of bond energies for gas-phase cluster ions of halide ions with methane and chloromethanes, J. Phys. Chem. A, 2001, 105, 20, 4887-4893, https://doi.org/10.1021/jp010143n . [all data]